OBOE Temporal
type: Ontology
version info: Version 1.0
comment: Copyright (c) 2006-2011 The Regents of the University of California. All rights reserved. This work is licensed under the Creative Commons Attribution 3.0 Unported License. To view a copy of this license, visit http://creativecommons.org/licenses/by/3.0/ or send a letter to Creative Commons, 444 Castro Street, Suite 900, Mountain View, California, 94041, USA.
comment: This ontology terms relating to temporal concepts that are common across OBOE extensions. The terms are derived from the International Standards Organization (ISO) geospatial standards in the 19100 series and from the Geography Markup Language version 3.2.1.
imports: oboe-core AnaEE-F.owl

Temporal Entity
type: Class
subclass of: Entity

Time Calendar
type: Class
subclass of: Time Reference System

Time Clock
type: Class
subclass of: Time Reference System

Time Coordinate Reference System
type: Class
subclass of: Time Reference System

Time Datum
type: Class
subclass of: Temporal Entity

Time Geometric Primitive
type: Class
subclass of: Time Primitive

Time Instant
type: Class
subclass of: Time Geometric Primitive

Time Ordinal Reference System
type: Class
subclass of: Time Reference System

Time Period
type: Class
subclass of: Time Geometric Primitive

Time Primitive
type: Class
subclass of: Temporal Entity

Time Reference System
type: Class
subclass of: Temporal Entity

Temporal Relationship
type: Class
subclass of: Relationship

After
type: Class
comment: A temporal relationship where an Entity is observed after another Entity.
subclass of: Temporal Relationship

Before
type: Class
comment: A temporal relationship where an Entity is observed prior to another Entity.
subclass of: Temporal Relationship

During
type: Class
comment: A temporal relationship where an Entity is observed concurrently with another Entity.
subclass of: Temporal Relationship